Target
Beta-1 adrenergic receptor
Ligand
BDBM50404785
Substrate
Meas. Tech.
ChEMBL_37080 (CHEMBL650921)
Kd
3.2±n/a nM
Citation
 Erhardt, PWWoo, CMGorczynski, RJAnderson, WG Ultra-short-acting beta-adrenergic receptor blocking agents. 1. (Aryloxy)propanolamines containing esters in the nitrogen substituent. J Med Chem 25:1402-7 (1983)  
Target
Name:
Beta-1 adrenergic receptor
Synonyms:
ADRB1 adrenergic Beta1
Type:
Enzyme Catalytic Domain
Mol. Mass.:
50540.48
Organism:
GUINEA PIG
Description:
adrenergic Beta1 ADRB1 GUINEA PIG::B0FL73
Residue:
467
  
Inhibitor
Name:
BDBM50404785
Synonyms:
CHEMBL31529
Type:
Small organic molecule
Emp. Form.:
C17H27NO4
Mol. Mass.:
309.4006
SMILES:
CCOC(=O)CC(C)(C)NCC(O)COc1ccccc1C
: