Target
Beta-2 adrenergic receptor
Ligand
BDBM50404765
Substrate
Meas. Tech.
ChEMBL_38008 (CHEMBL655218)
Kd
1000±n/a nM
Citation
 Erhardt, PWWoo, CMGorczynski, RJAnderson, WG Ultra-short-acting beta-adrenergic receptor blocking agents. 1. (Aryloxy)propanolamines containing esters in the nitrogen substituent. J Med Chem 25:1402-7 (1983)  
Target
Name:
Beta-2 adrenergic receptor
Synonyms:
ADRB2_CAVPO adrenergic Beta2
Type:
Enzyme Catalytic Domain
Mol. Mass.:
46993.24
Organism:
GUINEA PIG
Description:
adrenergic Beta2 ADRB2 GUINEA PIG::Q8K4Z4
Residue:
418
  
Inhibitor
Name:
BDBM50404765
Synonyms:
CHEMBL31050
Type:
Small organic molecule
Emp. Form.:
C16H27NO4
Mol. Mass.:
297.3899
SMILES:
CCOC(=O)CCNCC(O)COC1=CC=CCC1(C)C
: