Target
Delta-type opioid receptor
Ligand
BDBM50404816
Substrate
Meas. Tech.
ChEBML_146492
IC50
3.9±n/a nM
Citation
 Fauchère, JL A quantitative structure-activity relationship study of the inhibitory action of a series of enkephalin-like peptides in the guinea pig ileum and mouse vas deferens bioassays. J Med Chem 25:1428-31 (1983)  
Target
Name:
Delta-type opioid receptor
Synonyms:
DOR-1 MSL-2 OPRD_MOUSE Oprd1
Type:
Enzyme Catalytic Domain
Mol. Mass.:
40577.25
Organism:
MOUSE
Description:
P32300
Residue:
372
  
Inhibitor
Name:
BDBM50404816
Synonyms:
CHEMBL434006
Type:
Small organic molecule
Emp. Form.:
C29H39N7O8
Mol. Mass.:
613.6621
SMILES:
CC(C)C[C@H](NC(=O)[C@H](Cc1ccc(cc1)[N+]([O-])=O)NC(=O)CNC(=O)[C@H](C)NC(=O)[C@@H](N)Cc1ccc(O)cc1)C(N)=O
: