Target
Polyunsaturated fatty acid 5-lipoxygenase
Ligand
BDBM50009014
Substrate
Meas. Tech.
ChEBML_177026
IC50
1100±n/a nM
Citation
 Bruneau, PDelvare, CEdwards, MPMcMillan, RM Indazolinones, a new series of redox-active 5-lipoxygenase inhibitors with built-in selectivity and oral activity. J Med Chem 34:1028-36 (1991)  
Target
Name:
Polyunsaturated fatty acid 5-lipoxygenase
Synonyms:
Alox5 LOX5_RAT
Type:
PROTEIN
Mol. Mass.:
78082.31
Organism:
Rattus norvegicus
Description:
ChEMBL_1432947
Residue:
673
  
Inhibitor
Name:
BDBM50009014
Synonyms:
2-(1H-Indol-3-ylmethyl)-1,2-dihydro-indazol-3-one | CHEMBL3144574
Type:
Small organic molecule
Emp. Form.:
C16H13N3O
Mol. Mass.:
263.2939
SMILES:
O=c1n(Cc2c[nH]c3ccccc23)[nH]c2ccccc12
: