Target
Angiotensin-converting enzyme
Ligand
BDBM50406905
Substrate
Meas. Tech.
ChEBML_36150
IC50
2.2±n/a nM
Citation
 Waller, CLMarshall, GR Three-dimensional quantitative structure-activity relationship of angiotesin-converting enzyme and thermolysin inhibitors. II. A comparison of CoMFA models incorporating molecular orbital fields and desolvation free energies based on active-analog and complementary-receptor-field alignment rules. J Med Chem 36:2390-403 (1993)  
Target
Name:
Angiotensin-converting enzyme
Synonyms:
ACE Angiotensin converting enzyme (ACE) Angiotensin-converting enzyme, soluble form CD_antigen=CD143 DCP1 Kininase II
Type:
Enzyme
Mol. Mass.:
149709.01
Organism:
Homo sapiens (Human)
Description:
Residue:
1306
  
Inhibitor
Name:
BDBM50406905
Synonyms:
CHEMBL78346
Type:
Small organic molecule
Emp. Form.:
C22H30N2O5
Mol. Mass.:
402.484
SMILES:
C[C@H](NC(CCc1ccccc1)C(O)=O)C(=O)N1CC2CCCCC2[C@H]1C(O)=O
: