Target
Gag-Pol polyprotein [489-587]
Ligand
BDBM1201
Substrate
Meas. Tech.
ChEMBL_159137 (CHEMBL859312)
Ki
79.4±n/a nM
Citation
 Kroemer, RTEttmayer, PHecht, P 3D-quantitative structure-activity relationships of human immunodeficiency virus type-1 proteinase inhibitors: comparative molecular field analysis of 2-heterosubstituted statine derivatives-implications for the design of novel inhibitors. J Med Chem 38:4917-28 (1996)  
Target
Name:
Gag-Pol polyprotein [489-587]
Synonyms:
Human immunodeficiency virus type 1 protease Pol polyprotein | gag-pol
Type:
Enzyme Subunit
Mol. Mass.:
10781.16
Organism:
Human immunodeficiency virus type 1
Description:
P04585[489-587]
Residue:
99
  
Inhibitor
Name:
BDBM1201
Synonyms:
2-Aminobenzyl-Substituted AHPPA deriv. 18 | tert-butyl N-[(2S,3R,4R)-3-hydroxy-4-{[(1S,2R)-2-hydroxy-2,3-dihydro-1H-inden-1-yl]carbamoyl}-4-({[4-(2-hydroxyethoxy)phenyl]methyl}amino)-1-phenylbutan-2-yl]carbamate
Type:
Small organic molecule
Emp. Form.:
C34H43N3O7
Mol. Mass.:
605.7211
SMILES:
CC(C)(C)OC(=O)N[C@@H](Cc1ccccc1)[C@@H](O)[C@@H](NCc1ccc(OCCO)cc1)C(=O)N[C@@H]1[C@H](O)Cc2ccccc12
: