Target
Acetylcholinesterase
Ligand
BDBM50032165
Substrate
Meas. Tech.
ChEMBL_28756 (CHEMBL641020)
IC50
2.8±n/a nM
Citation
 Tong, WCollantes, ERChen, YWelsh, WJ A comparative molecular field analysis study of N-benzylpiperidines as acetylcholinesterase inhibitors. J Med Chem 39:380-7 (1996)  
Target
Name:
Acetylcholinesterase
Synonyms:
ACES_HUMAN Acetylcholinesterase (AChE) | Acetylcholinesterase (human AChE)
Type:
Enzyme
Mol. Mass.:
67792.70
Organism:
Homo sapiens (Human)
Description:
P22303
Residue:
614
  
Inhibitor
Name:
BDBM50032165
Synonyms:
CHEMBL92736 N-{3-[2-(1-Benzyl-piperidin-4-yl)-ethyl]-benzo[d]isoxazol-6-yl}-acetamide; compound with (E)-but-2-enedioic acid
Type:
Small organic molecule
Emp. Form.:
C23H27N3O2
Mol. Mass.:
377.4794
SMILES:
CC(=O)Nc1ccc2c(CCC3CCN(Cc4ccccc4)CC3)noc2c1
: