Target
Acetylcholinesterase
Ligand
BDBM9420
Substrate
Meas. Tech.
ChEMBL_28928 (CHEMBL857056)
IC50
52000±n/a nM
Citation
 Tong, WCollantes, ERChen, YWelsh, WJ A comparative molecular field analysis study of N-benzylpiperidines as acetylcholinesterase inhibitors. J Med Chem 39:380-7 (1996)  
Target
Name:
Acetylcholinesterase
Synonyms:
ACES_MOUSE Acetylcholinesterase (mouse AChE) Ache
Type:
Enzyme
Mol. Mass.:
68165.65
Organism:
Mus musculus (mouse)
Description:
Residue:
614
  
Inhibitor
Name:
BDBM9420
Synonyms:
N-[2-(1-benzoylpiperidin-4-yl)ethyl]-N-methylbenzamide | Piperidine Derivative 33
Type:
Small organic molecule
Emp. Form.:
C22H26N2O2
Mol. Mass.:
350.454
SMILES:
CN(CCC1CCN(CC1)C(=O)c1ccccc1)C(=O)c1ccccc1
: