Target
Aryl hydrocarbon receptor
Ligand
BDBM50408319
Substrate
Meas. Tech.
ChEMBL_36196 (CHEMBL649365)
EC50
1300±n/a nM
Citation
 So, SSKarplus, M Three-dimensional quantitative structure-activity relationships from molecular similarity matrices and genetic neural networks. 2. Applications. J Med Chem 40:4360-71 (1998)  
Target
Name:
Aryl hydrocarbon receptor
Synonyms:
AHR BHLHE76 aryl hydrocarbon receptor precursor
Type:
PROTEIN
Mol. Mass.:
96143.77
Organism:
Homo sapiens (Human)
Description:
ChEMBL_1503828
Residue:
848
  
Inhibitor
Name:
BDBM50408319
Synonyms:
CHEMBL343583
Type:
Small organic molecule
Emp. Form.:
C12H4Cl4O2
Mol. Mass.:
321.971
SMILES:
Clc1c(Cl)c(Cl)c2Oc3ccccc3Oc2c1Cl
: