Target
5-hydroxytryptamine receptor 1D
Ligand
BDBM50408707
Substrate
Meas. Tech.
ChEMBL_1758 (CHEMBL616544)
Ki
200±n/a nM
Citation
 Gaster, LMBlaney, FEDavies, SDuckworth, DMHam, PJenkins, SJennings, AJJoiner, GFKing, FDMulholland, KRWyman, PAHagan, JJHatcher, JJones, BJMiddlemiss, DNPrice, GWRiley, GRoberts, CRoutledge, CSelkirk, JSlade, PD The selective 5-HT1B receptor inverse agonist 1'-methyl-5-[[2'-methyl-4'-(5-methyl-1,2, 4-oxadiazol-3-yl)biphenyl-4-yl]carbonyl]-2,3,6,7-tetrahydro- spiro[furo[2,3-f]indole-3,4'-piperidine] (SB-224289) potently blocks terminal 5-HT autoreceptor function both in vitro and in vivo. J Med Chem 41:1218-35 (1998)  
Target
Name:
5-hydroxytryptamine receptor 1D
Synonyms:
5-HT-1D 5-HT1D 5HT1D_HUMAN HTR1DA Serotonin (5-HT) receptor | Serotonin Receptor 1D
Type:
G Protein-Coupled Receptor (GPCR)
Mol. Mass.:
41920.63
Organism:
Homo sapiens (Human)
Description:
Receptor binding assays were performed using human clone stably expressed in CHO cells.
Residue:
377
  
Inhibitor
Name:
BDBM50408707
Synonyms:
CHEMBL21369
Type:
Small organic molecule
Emp. Form.:
C19H22BrN3O
Mol. Mass.:
388.301
SMILES:
CN1CCN(CC1)c1cccc(NC(=O)c2ccc(Br)c(C)c2)c1
: