Target
Neuronal acetylcholine receptor subunit alpha-4/beta-2
Ligand
BDBM50088453
Substrate
Meas. Tech.
ChEMBL_143711 (CHEMBL756010)
IC50
0.87±n/a nM
Citation
 Nielsen, SFNielsen, EOOlsen, GMLiljefors, TPeters, D Novel potent ligands for the central nicotinic acetylcholine receptor: synthesis, receptor binding, and 3D-QSAR analysis. J Med Chem 43:2217-26 (2000)  
Target
Name:
Neuronal acetylcholine receptor subunit alpha-4/beta-2
Synonyms:
Neuronal acetylcholine receptor alpha4/beta2 Neuronal acetylcholine receptor; alpha4/beta2
Type:
Mol. Mass.:
Description:
Components:
This complex has 0 components.
Component 1
Name:
Neuronal acetylcholine receptor subunit alpha-4
Synonyms:
ACHA4_RAT Cholinergic, Nicotinic Alpha4Beta2 Chrna4 Neuronal acetylcholine receptor (alpha4beta2 nAChR) Neuronal acetylcholine receptor subunit alpha 4 beta 2 | Neuronal acetylcholine receptor subunit alpha-4
Type:
Enzyme
Mol. Mass.:
70196.44
Organism:
Rattus norvegicus (Rat)
Description:
P09483
Residue:
630
  
Component 2
Name:
Neuronal acetylcholine receptor subunit beta-2
Synonyms:
ACHB2_RAT Chrnb2 Neuronal acetylcholine receptor non-alpha-1 chain
Type:
Enzyme
Mol. Mass.:
56910.32
Organism:
Rattus norvegicus (Rat)
Description:
P12390
Residue:
500
  
Inhibitor
Name:
BDBM50088453
Synonyms:
1-(6-Bromo-5-ethoxy-pyridin-3-yl)-[1,4]diazepane CHEMBL72433 | NS3570, 5
Type:
Small organic molecule
Emp. Form.:
C12H18BrN3O
Mol. Mass.:
300.195
SMILES:
CCOc1cc(cnc1Br)N1CCCNCC1
: