Target
Beta-3 adrenergic receptor
Ligand
BDBM50409473
Substrate
Meas. Tech.
ChEMBL_218265 (CHEMBL819430)
EC50
81.28±n/a nM
Citation
 Tanaka, NTamai, TMukaiyama, HHirabayashi, AMuranaka, HAkahane, SMiyata, HAkahane, M Discovery of novel N-phenylglycine derivatives as potent and selective beta(3)-adrenoceptor agonists for the treatment of frequent urination and urinary incontinence. J Med Chem 44:1436-45 (2001)  
Target
Name:
Beta-3 adrenergic receptor
Synonyms:
ADRB3_RAT Adrb3r Beta-3 adrenergic receptor
Type:
PROTEIN
Mol. Mass.:
43161.83
Organism:
Rattus norvegicus
Description:
ChEMBL_1509452
Residue:
400
  
Inhibitor
Name:
BDBM50409473
Synonyms:
CHEMBL33399
Type:
Small organic molecule
Emp. Form.:
C19H22Br2N2O4
Mol. Mass.:
502.197
SMILES:
C[C@H](NCCc1cc(Br)c(NCC(O)=O)c(Br)c1)[C@H](O)c1ccc(O)cc1
: