Target
Prostaglandin G/H synthase 2
Ligand
BDBM50057915
Substrate
Meas. Tech.
ChEMBL_157821 (CHEMBL858334)
IC50
398000000±n/a nM
Citation
 Desiraju, GRGopalakrishnan, BJetti, RKNagaraju, ARaveendra, DSarma, JASobhia, METhilagavathi, R Computer-aided design of selective COX-2 inhibitors: comparative molecular field analysis, comparative molecular similarity indices analysis, and docking studies of some 1,2-diarylimidazole derivatives. J Med Chem 45:4847-57 (2002)  
Target
Name:
Prostaglandin G/H synthase 2
Synonyms:
Cox-2 Cyclooxygenase-2 Glucocorticoid-regulated inflammatory cyclooxygenase Macrophage activation-associated marker protein P71/73 PGH synthase 2 PGHS-2 Pghs-b Prostaglandin H2 synthase 2 Ptgs2 Tis10
Type:
Protein
Mol. Mass.:
69020.39
Organism:
Mus musculus (Mouse)
Description:
Q05769
Residue:
604
  
Inhibitor
Name:
BDBM50057915
Synonyms:
2-(2-Fluoro-phenyl)-1-(4-methanesulfonyl-phenyl)-4-trifluoromethyl-1H-imidazole | CHEMBL43645
Type:
Small organic molecule
Emp. Form.:
C17H12F4N2O2S
Mol. Mass.:
384.348
SMILES:
CS(=O)(=O)c1ccc(cc1)-n1cc(nc1-c1ccccc1F)C(F)(F)F
: