Target
Integrin alpha-V/beta-3
Ligand
BDBM50166693
Substrate
Meas. Tech.
ChEMBL_304605 (CHEMBL877128)
IC50
0.25±n/a nM
Citation
 Leonard, KPan, WAnaclerio, BGushue, JMGuo, ZDesJarlais, RLChaikin, MALattanze, JCrysler, CManthey, CLTomczuk, BEMarugan, JJ Non-peptidic alpha(v)beta3 antagonists containing indol-1-yl propionic acids. Bioorg Med Chem Lett 15:2679-84 (2005)  
Target
Name:
Integrin alpha-V/beta-3
Synonyms:
ITGAV/ITGB3 | Integrin beta-3/Vitronectin receptor alpha
Type:
Enzyme
Mol. Mass.:
Description:
Components:
This complex has 2 components.
Component 1
Name:
Integrin alpha-V
Synonyms:
ITAV_HUMAN Integrin alpha-V/alpha-5 VNRA Vitronectin receptor | Vitronectin receptor subunit alpha
Type:
PROTEIN
Mol. Mass.:
116024.92
Organism:
Homo sapiens (Human)
Description:
ChEMBL_582336
Residue:
1048
  
Component 2
Name:
Integrin beta-3
Synonyms:
CD_antigen=CD61 GPIIIa ITGB3 Platelet membrane glycoprotein IIIa
Type:
Protein
Mol. Mass.:
87038.91
Organism:
Homo sapiens (Human)
Description:
P05106
Residue:
788
  
Inhibitor
Name:
BDBM50166693
Synonyms:
3-Pyridin-3-yl-3-{5-[2-(5,6,7,8-tetrahydro-[1,8]naphthyridin-2-yl)-ethoxy]-indol-1-yl}-propionic acid CHEMBL190128
Type:
Small organic molecule
Emp. Form.:
C26H26N4O3
Mol. Mass.:
442.5096
SMILES:
OC(=O)CC(c1cccnc1)n1ccc2cc(OCCc3ccc4CCCNc4n3)ccc12
: