Target
Androgen receptor
Ligand
BDBM50410516
Substrate
Meas. Tech.
ChEMBL_321687 (CHEMBL872182)
IC50
89.13±n/a nM
Citation
 Lill, MAWiniger, FVedani, AErnst, B Impact of induced fit on ligand binding to the androgen receptor: a multidimensional QSAR study to predict endocrine-disrupting effects of environmental chemicals. J Med Chem 48:5666-74 (2005)  
Target
Name:
Androgen receptor
Synonyms:
ANDR_RAT Ar Nr3c4 | androgen
Type:
Enzyme
Mol. Mass.:
98219.08
Organism:
Rattus norvegicus (Rat)
Description:
P15207
Residue:
902
  
Inhibitor
Name:
BDBM50410516
Synonyms:
CHEMBL263818
Type:
Small organic molecule
Emp. Form.:
C17H24O2
Mol. Mass.:
260.3713
SMILES:
O=C1CCC2C1CC(=O)C1C2CCC2CCCCC12
: