Target
Cathepsin K
Ligand
BDBM50410964
Substrate
Meas. Tech.
ChEMBL_365368 (CHEMBL871198)
Ki
1300±n/a nM
Citation
 Palmer, JTHirschbein, BLCheung, HMcCarter, JJanc, JWYu, ZWWesolowski, G Keto-1,3,4-oxadiazoles as cathepsin K inhibitors. Bioorg Med Chem Lett 16:2909-14 (2006)  
Target
Name:
Cathepsin K
Synonyms:
CATK_HUMAN CTSO Cathepsin O Cathepsin X
Type:
Enzyme
Mol. Mass.:
36975.68
Organism:
Homo sapiens (Human)
Description:
P43235
Residue:
329
  
Inhibitor
Name:
BDBM50410964
Synonyms:
CHEMBL209181
Type:
Small organic molecule
Emp. Form.:
C26H33F3N4O5
Mol. Mass.:
538.5592
SMILES:
CCC[C@H](NC(=O)C1(CCCCC1)NC(=O)c1ccc(OC(F)(F)F)cc1)C(=O)c1nnc(o1)C(C)(C)C
: