Target
Cathepsin B
Ligand
BDBM50374365
Substrate
Meas. Tech.
ChEMBL_365369 (CHEMBL871199)
Ki
220±n/a nM
Citation
 Palmer, JTHirschbein, BLCheung, HMcCarter, JJanc, JWYu, ZWWesolowski, G Keto-1,3,4-oxadiazoles as cathepsin K inhibitors. Bioorg Med Chem Lett 16:2909-14 (2006)  
Target
Name:
Cathepsin B
Synonyms:
APP secretase CATB_HUMAN CTSB Cathepsin B light chain | Cathepsin B1
Type:
Enzyme
Mol. Mass.:
37819.69
Organism:
Homo sapiens (Human)
Description:
gi_63102437
Residue:
339
  
Inhibitor
Name:
BDBM50374365
Synonyms:
CHEMBL209215
Type:
Small organic molecule
Emp. Form.:
C26H27F3N4O6
Mol. Mass.:
548.511
SMILES:
CCC[C@H](NC(=O)C1(CCCCC1)NC(=O)c1ccc(OC(F)(F)F)cc1)C(=O)c1nnc(o1)-c1ccco1
: