Target
Procathepsin L
Ligand
BDBM50410979
Substrate
Meas. Tech.
ChEMBL_365370 (CHEMBL863024)
Ki
1±n/a nM
Citation
 Palmer, JTHirschbein, BLCheung, HMcCarter, JJanc, JWYu, ZWWesolowski, G Keto-1,3,4-oxadiazoles as cathepsin K inhibitors. Bioorg Med Chem Lett 16:2909-14 (2006)  
Target
Name:
Procathepsin L
Synonyms:
CATL1_HUMAN CTSL CTSL1 Cathepsin L Cathepsin L1 heavy chain MEP cathepsin L preproprotein
Type:
Enzyme
Mol. Mass.:
37557.19
Organism:
Homo sapiens (Human)
Description:
Purchased from Calbiochem (San Diego, CA).
Residue:
333
  
Inhibitor
Name:
BDBM50410979
Synonyms:
CHEMBL207347
Type:
Small organic molecule
Emp. Form.:
C25H29N3O6
Mol. Mass.:
467.5143
SMILES:
CCC[C@H](NC(=O)[C@H](CC(C)C)C(=O)OCc1ccccc1)C(=O)c1nnc(o1)-c1ccco1
: