Target
Coagulation factor XI
Ligand
BDBM50410995
Substrate
Meas. Tech.
ChEMBL_371014 (CHEMBL868512)
Ki
>150000±n/a nM
Citation
 Palmer, JTRydzewski, RMMendonca, RVSperandio, DSpencer, JRHirschbein, BLLohman, JBeltman, JNguyen, MLiu, L Design and synthesis of selective keto-1,2,4-oxadiazole-based tryptase inhibitors. Bioorg Med Chem Lett 16:3434-9 (2006)  
Target
Name:
Coagulation factor XI
Synonyms:
Coagulation factor XIa Coagulation factor XIa light chain FA11_HUMAN Factor XIa PTA | Plasma thromboplastin antecedent
Type:
Enzyme
Mol. Mass.:
70130.58
Organism:
Homo sapiens (Human)
Description:
P03951
Residue:
625
  
Inhibitor
Name:
BDBM50410995
Synonyms:
CHEMBL536972
Type:
Small organic molecule
Emp. Form.:
C30H28Cl2F2N4O4
Mol. Mass.:
617.471
SMILES:
NCCCC[C@H](NC(=O)c1ccc(F)c(F)c1)C(=O)c1noc(Cc2ccc(OCCc3ccc(Cl)c(Cl)c3)cc2)n1
: