Target
Reverse transcriptase/RNaseH
Ligand
BDBM50411076
Substrate
Meas. Tech.
ChEMBL_373030 (CHEMBL871577)
EC50
>60500±n/a nM
Citation
 Mugnaini, CManetti, FEsté, JAClotet-Codina, IMaga, GCancio, RBotta, MCorelli, F Synthesis and biological investigation of S-aryl-S-DABO derivatives as HIV-1 inhibitors. Bioorg Med Chem Lett 16:3541-4 (2006)  
Target
Name:
Reverse transcriptase/RNaseH
Synonyms:
HIV-1 Reverse Transcriptase RNase H Reverse transcriptase/RNaseH
Type:
PROTEIN
Mol. Mass.:
65229.15
Organism:
Human immunodeficiency virus 1
Description:
ChEMBL_1473730
Residue:
566
  
Inhibitor
Name:
BDBM50411076
Synonyms:
CHEMBL210820
Type:
Small organic molecule
Emp. Form.:
C18H12Cl2F2N2OS
Mol. Mass.:
413.268
SMILES:
Cc1c(Cc2c(Cl)cccc2Cl)nc(Sc2ccc(F)cc2F)[nH]c1=O
: