Target
Peptide deformylase
Ligand
BDBM50411101
Substrate
Meas. Tech.
ChEMBL_400520 (CHEMBL912684)
IC50
7500±n/a nM
Citation
 Yoo, JSZheng, CJLee, SKwak, JHKim, WG Macrolactin N, a new peptide deformylase inhibitor produced by Bacillus subtilis. Bioorg Med Chem Lett 16:4889-92 (2006)  
Target
Name:
Peptide deformylase
Synonyms:
DEF_STAAM Polypeptide deformylase def1 | pdf1
Type:
Enzyme
Mol. Mass.:
20556.80
Organism:
Staphylococcus aureus
Description:
P68825
Residue:
183
  
Inhibitor
Name:
BDBM50411101
Synonyms:
CHEMBL425430
Type:
Small organic molecule
Emp. Form.:
C24H34O4
Mol. Mass.:
386.5244
SMILES:
CC1CCC\C=C\CCC(=O)CCC\C=C/C=C/[C@@H](O)C\C=C\C=C/C(=O)O1
: