Target
Acyl carrier protein, mitochondrial
Ligand
BDBM50411917
Substrate
Meas. Tech.
ChEMBL_469770 (CHEMBL948046)
IC50
>24300±n/a nM
Citation
 Surup, FShojaei, Hvon Zezschwitz, PKunze, BGrond, S Iromycins from Streptomyces sp. and from synthesis: new inhibitors of the mitochondrial electron transport chain. Bioorg Med Chem 16:1738-46 (2008)  
Target
Name:
Acyl carrier protein, mitochondrial
Synonyms:
ACP CI-SDAP NDUFAB1
Type:
PROTEIN
Mol. Mass.:
17397.64
Organism:
Bos taurus
Description:
ChEMBL_469770
Residue:
156
  
Inhibitor
Name:
BDBM50411917
Synonyms:
CHEMBL256056
Type:
Small organic molecule
Emp. Form.:
C20H31NO3
Mol. Mass.:
333.465
SMILES:
CCCc1c(C\C=C(/C)C\C=C\C(C)(C)O)[nH]c(=O)c(C)c1OC
: