Target
Muscarinic acetylcholine receptor M1
Ligand
BDBM82423
Substrate
Meas. Tech.
ChEMBL_491018 (CHEMBL982066)
Ki
3.55±n/a nM
Citation
 Minarini, AMarucci, GBellucci, CGiorgi, GTumiatti, VBolognesi, MLMatera, RRosini, MMelchiorre, C Design, synthesis, and biological evaluation of pirenzepine analogs bearing a 1,2-cyclohexanediamine and perhydroquinoxaline units in exchange for the piperazine ring as antimuscarinics. Bioorg Med Chem 16:7311-20 (2008)  
Target
Name:
Muscarinic acetylcholine receptor M1
Synonyms:
ACM1_HUMAN Cholinergic receptor, muscarinic 1 | Cholinergic, muscarinic M1
Type:
Protein
Mol. Mass.:
51442.54
Organism:
Homo sapiens (Human)
Description:
P11229
Residue:
460
  
Inhibitor
Name:
BDBM82423
Synonyms:
CAS_132947 TRIPITRAMINE
Type:
Small organic molecule
Emp. Form.:
C64H77N13O6
Mol. Mass.:
1124.3797
SMILES:
CN(CCCCCCCCN(C)CCCCCCN(CC(=O)N1c2ccccc2C(=O)Nc2cccnc12)CC(=O)N1c2ccccc2C(=O)Nc2cccnc12)CCCCCCNCC(=O)N1c2ccccc2C(=O)Nc2cccnc12
: