Target
D(1A) dopamine receptor
Ligand
BDBM50201338
Substrate
Meas. Tech.
ChEMBL_491079 (CHEMBL982102)
Ki
0.562±n/a nM
Citation
 Enzensperger, CGörnemann, TPertz, HHLehmann, J Dopamine/serotonin receptor ligands. Part 17: a cross-target SAR approach: affinities of azecine-styled ligands for 5-HT(2A) versus D1 and D2 receptors. Bioorg Med Chem Lett 18:3809-13 (2008)  
Target
Name:
D(1A) dopamine receptor
Synonyms:
DA D1 receptor DRD1 Dopamine D1 receptor Dopamine D1A
Type:
Enzyme
Mol. Mass.:
49303.43
Organism:
Homo sapiens (Human)
Description:
P21728
Residue:
446
  
Inhibitor
Name:
BDBM50201338
Synonyms:
7-methyl-6,7,8,9,14,15-hexahydro-5H-indolo[3,2-f][3]benzazecin-11-ol | CHEMBL245570
Type:
Small organic molecule
Emp. Form.:
C20H22N2O
Mol. Mass.:
306.4015
SMILES:
CN1CCc2c(Cc3ccccc3CC1)[nH]c1ccc(O)cc21
: