Target
D(2) dopamine receptor
Ligand
BDBM50088341
Substrate
Meas. Tech.
ChEMBL_491080 (CHEMBL982103)
Ki
41.69±n/a nM
Citation
 Enzensperger, CGörnemann, TPertz, HHLehmann, J Dopamine/serotonin receptor ligands. Part 17: a cross-target SAR approach: affinities of azecine-styled ligands for 5-HT(2A) versus D1 and D2 receptors. Bioorg Med Chem Lett 18:3809-13 (2008)  
Target
Name:
D(2) dopamine receptor
Synonyms:
D(2) dopamine receptor DOPAMINE D2 Long DRD2 Dopamine D2 receptor Dopamine D2 receptor (D2R) Dopamine2-like | d2
Type:
Cell-surface receptors
Mol. Mass.:
50647.10
Organism:
Homo sapiens (Human)
Description:
P14416
Residue:
443
  
Inhibitor
Name:
BDBM50088341
Synonyms:
11-methyl-11,21-diazatetracyclo[12.7.0.0^{3,8}.0^{15,20}]henicosa-1(14),3(8),4,6,15,17,19-heptaene 7-methyl-6,7,8,9,14,15-hexahydro-5H-benzo[7,8]azecino[5,4-b]indole(LE 300) CHEMBL441618 | LE 300
Type:
Small organic molecule
Emp. Form.:
C20H22N2
Mol. Mass.:
290.4021
SMILES:
CN1CCc2c(Cc3ccccc3CC1)[nH]c1ccccc21
: