Target
D(2) dopamine receptor
Ligand
BDBM50412383
Substrate
Meas. Tech.
ChEMBL_491080 (CHEMBL982103)
Ki
389.05±n/a nM
Citation
 Enzensperger, CGörnemann, TPertz, HHLehmann, J Dopamine/serotonin receptor ligands. Part 17: a cross-target SAR approach: affinities of azecine-styled ligands for 5-HT(2A) versus D1 and D2 receptors. Bioorg Med Chem Lett 18:3809-13 (2008)  
Target
Name:
D(2) dopamine receptor
Synonyms:
D(2) dopamine receptor DOPAMINE D2 Long DRD2 Dopamine D2 receptor Dopamine D2 receptor (D2R) Dopamine2-like | d2
Type:
Cell-surface receptors
Mol. Mass.:
50647.10
Organism:
Homo sapiens (Human)
Description:
P14416
Residue:
443
  
Inhibitor
Name:
BDBM50412383
Synonyms:
CHEMBL459871
Type:
Small organic molecule
Emp. Form.:
C17H19NO
Mol. Mass.:
253.3389
SMILES:
Oc1ccc2Cc3ccccc3CCNCCc2c1
: