Target
Salicyl-AMP ligase / salicyl-S-ArCP synthetase
Ligand
BDBM50412821
Substrate
Meas. Tech.
ChEMBL_496141 (CHEMBL999364)
Ki
0.59±n/a nM
Citation
 Gupte, ABoshoff, HIWilson, DJNeres, JLabello, NPSomu, RVXing, CBarry, CEAldrich, CC Inhibition of siderophore biosynthesis by 2-triazole substituted analogues of 5'-O-[N-(salicyl)sulfamoyl]adenosine: antibacterial nucleosides effective against Mycobacterium tuberculosis. J Med Chem 51:7495-507 (2009)  
Target
Name:
Salicyl-AMP ligase / salicyl-S-ArCP synthetase
Synonyms:
2,3-dihydroxybenzoate-AMP ligase mbtA
Type:
PROTEIN
Mol. Mass.:
59275.32
Organism:
Mycobacterium tuberculosis
Description:
ChEMBL_423930
Residue:
565
  
Inhibitor
Name:
BDBM50412821
Synonyms:
CHEMBL608839
Type:
Small organic molecule
Emp. Form.:
C26H25N9O8S
Mol. Mass.:
623.597
SMILES:
Cc1ccccc1-c1cn(nn1)-c1nc(N)c2ncn(C3OC(COS(=O)(=O)NC(=O)c4ccccc4O)C(O)C3O)c2n1
: