Target
Salicyl-AMP ligase / salicyl-S-ArCP synthetase
Ligand
BDBM50412842
Substrate
Meas. Tech.
ChEMBL_496141 (CHEMBL999364)
Ki
1.1±n/a nM
Citation
 Gupte, ABoshoff, HIWilson, DJNeres, JLabello, NPSomu, RVXing, CBarry, CEAldrich, CC Inhibition of siderophore biosynthesis by 2-triazole substituted analogues of 5'-O-[N-(salicyl)sulfamoyl]adenosine: antibacterial nucleosides effective against Mycobacterium tuberculosis. J Med Chem 51:7495-507 (2009)  
Target
Name:
Salicyl-AMP ligase / salicyl-S-ArCP synthetase
Synonyms:
2,3-dihydroxybenzoate-AMP ligase mbtA
Type:
PROTEIN
Mol. Mass.:
59275.32
Organism:
Mycobacterium tuberculosis
Description:
ChEMBL_423930
Residue:
565
  
Inhibitor
Name:
BDBM50412842
Synonyms:
CHEMBL612040
Type:
Small organic molecule
Emp. Form.:
C25H23N9O9S
Mol. Mass.:
625.57
SMILES:
Nc1nc(nc2n(cnc12)C1OC(COS(=O)(=O)NC(=O)c2ccccc2O)C(O)C1O)-n1cc(nn1)-c1ccccc1O
: