Target
5-hydroxytryptamine receptor 1A
Ligand
BDBM50413084
Substrate
Meas. Tech.
ChEMBL_492738 (CHEMBL938538)
Ki
0.316±n/a nM
Citation
 Bromidge, SMBertani, BBorriello, MFaedo, SGordon, LJGranci, EHill, MMarshall, HRStasi, LPZucchelli, VMerlo, GVesentini, AWatson, JMZonzini, L 6-[2-(4-Aryl-1-piperazinyl)ethyl]-2H-1,4-benzoxazin-3(4H)-ones: dual-acting 5-HT1 receptor antagonists and serotonin reuptake inhibitors. Bioorg Med Chem Lett 18:5653-6 (2008)  
Target
Name:
5-hydroxytryptamine receptor 1A
Synonyms:
5-HT-1A 5-hydroxytryptamine receptor 1A (5-HT-1A) ADRB2RL1 Dopamine D2 receptor and serotonin 1a receptor HTR1A | Serotonin receptor 1A
Type:
Mol. Mass.:
46122.49
Organism:
Homo sapiens (Human)
Description:
Residue:
422
  
Inhibitor
Name:
BDBM50413084
Synonyms:
CHEMBL521506
Type:
Small organic molecule
Emp. Form.:
C24H25ClN4O2
Mol. Mass.:
436.934
SMILES:
Cc1ccc2c(cc(Cl)cc2n1)N1CCN(CCc2ccc3OCC(=O)Nc3c2)CC1
: