Target
5-hydroxytryptamine receptor 1D
Ligand
BDBM50413557
Substrate
Meas. Tech.
ChEMBL_501243 (CHEMBL976145)
Ki
0.398±n/a nM
Citation
 Bromidge, SMBertani, BBorriello, MBozzoli, AFaedo, SGianotti, MGordon, LJHill, MZucchelli, VWatson, JMZonzini, L 8-[2-(4-Aryl-1-piperazinyl)ethyl]-2H-1,4-benzoxazin-3(4H)-ones: dual-acting 5-HT1 receptor antagonists and serotonin reuptake inhibitors--part II. Bioorg Med Chem Lett 19:2338-42 (2009)  
Target
Name:
5-hydroxytryptamine receptor 1D
Synonyms:
5-HT-1D 5-HT1D 5HT1D_HUMAN HTR1DA Serotonin (5-HT) receptor | Serotonin Receptor 1D
Type:
G Protein-Coupled Receptor (GPCR)
Mol. Mass.:
41920.63
Organism:
Homo sapiens (Human)
Description:
Receptor binding assays were performed using human clone stably expressed in CHO cells.
Residue:
377
  
Inhibitor
Name:
BDBM50413557
Synonyms:
CHEMBL511279
Type:
Small organic molecule
Emp. Form.:
C26H28F2N4O2
Mol. Mass.:
466.5229
SMILES:
Cc1ccc2c(cccc2n1)N1CCN(CCc2cccc3N(CC(F)F)C(=O)COc23)CC1
: