Target
5-hydroxytryptamine receptor 1B
Ligand
BDBM50413556
Substrate
Meas. Tech.
ChEMBL_501241 (CHEMBL975276)
Ki
6.31±n/a nM
Citation
 Bromidge, SMBertani, BBorriello, MBozzoli, AFaedo, SGianotti, MGordon, LJHill, MZucchelli, VWatson, JMZonzini, L 8-[2-(4-Aryl-1-piperazinyl)ethyl]-2H-1,4-benzoxazin-3(4H)-ones: dual-acting 5-HT1 receptor antagonists and serotonin reuptake inhibitors--part II. Bioorg Med Chem Lett 19:2338-42 (2009)  
Target
Name:
5-hydroxytryptamine receptor 1B
Synonyms:
5-HT-1B 5-HT1B 5HT1B_HUMAN HTR1DB Serotonin (5-HT) receptor Serotonin Receptor 1B
Type:
G Protein-Coupled Receptor (GPCR)
Mol. Mass.:
43579.17
Organism:
Homo sapiens (Human)
Description:
Receptor binding assays were performed using human clone stably expressed in CHO cells
Residue:
390
  
Inhibitor
Name:
BDBM50413556
Synonyms:
CHEMBL469995
Type:
Small organic molecule
Emp. Form.:
C28H32N4O2
Mol. Mass.:
456.5793
SMILES:
Cc1ccc2c(cccc2n1)N1CCN(CCc2cccc3N(CC4CC4)C(=O)COc23)CC1
: