Target
Cannabinoid receptor 1
Ligand
BDBM50284000
Substrate
Meas. Tech.
ChEMBL_570538 (CHEMBL1026910)
Ki
9.51±n/a nM
Citation
 De Freitas, GBda Silva, LLRomeiro, NCFraga, CA Development of CoMFA and CoMSIA models of affinity and selectivity for indole ligands of cannabinoid CB1 and CB2 receptors. Eur J Med Chem 44:2482-96 (2009)  
Target
Name:
Cannabinoid receptor 1
Synonyms:
Brain-type cannabinoid receptor CB-R CNR1_RAT Cannabinoid receptor Cnr1 | Skr6
Type:
G Protein-Coupled Receptor (GPCR)
Mol. Mass.:
52856.55
Organism:
Rattus norvegicus (rat)
Description:
P20272
Residue:
473
  
Inhibitor
Name:
BDBM50284000
Synonyms:
(2-Methyl-1-pentyl-1H-indol-3-yl)-naphthalen-1-yl-methanone (2-methyl-1-pentyl-1H-indol-3-yl)(naphthalen-1-yl)methanone JWH-007
Type:
Small organic molecule
Emp. Form.:
C25H25NO
Mol. Mass.:
355.4721
SMILES:
CCCCCn1c(C)c(C(=O)c2cccc3ccccc23)c2ccccc12
: