Target
Cannabinoid receptor 1
Ligand
BDBM50170348
Substrate
Meas. Tech.
ChEMBL_570538 (CHEMBL1026910)
Ki
389.05±n/a nM
Citation
 De Freitas, GBda Silva, LLRomeiro, NCFraga, CA Development of CoMFA and CoMSIA models of affinity and selectivity for indole ligands of cannabinoid CB1 and CB2 receptors. Eur J Med Chem 44:2482-96 (2009)  
Target
Name:
Cannabinoid receptor 1
Synonyms:
Brain-type cannabinoid receptor CB-R CNR1_RAT Cannabinoid receptor Cnr1 | Skr6
Type:
G Protein-Coupled Receptor (GPCR)
Mol. Mass.:
52856.55
Organism:
Rattus norvegicus (rat)
Description:
P20272
Residue:
473
  
Inhibitor
Name:
BDBM50170348
Synonyms:
2-(4-Chloro-phenyl)-1-(1-pentyl-1H-indol-3-yl)-ethanone CHEMBL188819 | JWH-206
Type:
Small organic molecule
Emp. Form.:
C21H22ClNO
Mol. Mass.:
339.858
SMILES:
CCCCCn1cc(C(=O)Cc2ccc(Cl)cc2)c2ccccc12
: