Target
Serine/threonine-protein kinase Chk1
Ligand
BDBM50414219
Substrate
Meas. Tech.
ChEMBL_570759 (CHEMBL1026934)
Ki
2.5±n/a nM
Citation
 Brown, SPMuchmore, SW Large-scale application of high-throughput molecular mechanics with Poisson-Boltzmann surface area for routine physics-based scoring of protein-ligand complexes. J Med Chem 52:3159-65 (2009)  
Target
Name:
Serine/threonine-protein kinase Chk1
Synonyms:
CHEK1 CHK1 checkpoint homolog Checkpoint kinase-1 (CHK1)
Type:
Enzyme Catalytic Domain
Mol. Mass.:
54443.02
Organism:
Homo sapiens (Human)
Description:
gi_166295192
Residue:
476
  
Inhibitor
Name:
BDBM50414219
Synonyms:
CHEMBL559621
Type:
Small organic molecule
Emp. Form.:
C24H27N3O3
Mol. Mass.:
405.4895
SMILES:
COc1cc-2c(Cc3c(n[nH]c-23)-c2ccccc2)cc1OCCCN1CCOCC1
: