Target
Sigma non-opioid intracellular receptor 1
Ligand
BDBM50415164
Substrate
Meas. Tech.
ChEMBL_595183 (CHEMBL1040025)
Ki
0.0661±n/a nM
Citation
 Piergentili, AAmantini, CDel Bello, FGiannella, MMattioli, LPalmery, MPerfumi, MPigini, MSantoni, GTucci, PZotti, MQuaglia, W Novel highly potent and selective sigma 1 receptor antagonists related to spipethiane. J Med Chem 53:1261-9 (2010)  
Target
Name:
Sigma non-opioid intracellular receptor 1
Synonyms:
Aging-associated gene 8 protein SGMR1_HUMAN SIGMAR1 SR31747-binding protein Sigma 1-type opioid receptor Sigma1R | hSigmaR1
Type:
Enzyme Catalytic Domain
Mol. Mass.:
25124.85
Organism:
Homo sapiens (Human)
Description:
Q99720
Residue:
223
  
Inhibitor
Name:
BDBM50415164
Synonyms:
CHEMBL570529
Type:
Small organic molecule
Emp. Form.:
C21H23NO2
Mol. Mass.:
321.4128
SMILES:
O=C1CC(Oc2ccccc12)C1CCN(Cc2ccccc2)CC1
: