Target
Oxysterols receptor LXR-alpha
Ligand
BDBM19992
Substrate
Meas. Tech.
ChEMBL_625547 (CHEMBL1109727)
IC50
100±n/a nM
Citation
 Zuercher, WJBuckholz, RGCampobasso, NCollins, JLGalardi, CMGampe, RTHyatt, SMMerrihew, SLMoore, JTOplinger, JAReid, PRSpearing, PKStanley, TBStewart, ELWillson, TM Discovery of tertiary sulfonamides as potent liver X receptor antagonists. J Med Chem 53:3412-6 (2010)  
Target
Name:
Oxysterols receptor LXR-alpha
Synonyms:
LXRA Liver X receptor alpha Liver X receptor alpha (NR1H3) NR1H3 Nuclear orphan receptor LXR-alpha | Nuclear receptor subfamily 1 group H member 3
Type:
Enzyme Catalytic Domain
Mol. Mass.:
50403.85
Organism:
Homo sapiens (Human)
Description:
Q13133
Residue:
447
  
Inhibitor
Name:
BDBM19992
Synonyms:
2-[3-[3-[[2-chloro-3-(trifluoromethyl)phenyl]methyl-[2,2-di(phenyl)ethyl]amino]propoxy]phenyl]acetic acid CHEMBL59030 GW3965 US10669296, Compound GW3965 | US10945978, Compound 2
Type:
Small organic molecule
Emp. Form.:
C33H31ClF3NO3
Mol. Mass.:
582.052
SMILES:
OC(=O)Cc1cccc(OCCCN(CC(c2ccccc2)c2ccccc2)Cc2cccc(c2Cl)C(F)(F)F)c1
: