Target
Alpha-2A adrenergic receptor
Ligand
BDBM50417006
Substrate
Meas. Tech.
ChEMBL_664775 (CHEMBL1259385)
Ki
0.079±n/a nM
Citation
 Vacher, BFunes, PChopin, PCussac, DHeusler, PTourette, AMarien, M Rigid analogues of thea2-adrenergic blocker atipamezole: small changes, big consequences. J Med Chem 53:6986-95 (2010)  
Target
Name:
Alpha-2A adrenergic receptor
Synonyms:
ADA2A_HUMAN ADRA2R Adrenergic alpha2A Alpha-2 adrenergic receptor subtype C10 Alpha-2A adrenoreceptor alpha-2A adrenergic receptor [Homo sapiens]
Type:
Enzyme
Mol. Mass.:
48979.91
Organism:
Homo sapiens (Human)
Description:
P08913
Residue:
465
  
Inhibitor
Name:
BDBM50417006
Synonyms:
CHEMBL1256414
Type:
Small organic molecule
Emp. Form.:
C13H12N2
Mol. Mass.:
196.2478
SMILES:
C1[C@@H]2c3ccccc3C[C@]12c1cnc[nH]1
: