Target
Alpha-2C adrenergic receptor
Ligand
BDBM50417007
Substrate
Meas. Tech.
ChEMBL_664777 (CHEMBL1259387)
Ki
14±n/a nM
Citation
 Vacher, BFunes, PChopin, PCussac, DHeusler, PTourette, AMarien, M Rigid analogues of thea2-adrenergic blocker atipamezole: small changes, big consequences. J Med Chem 53:6986-95 (2010)  
Target
Name:
Alpha-2C adrenergic receptor
Synonyms:
ADA2C_HUMAN ADRA2L2 Adrenergic alpha2C Adrenergic receptor alpha Alpha-2 adrenergic receptor subtype C4 Alpha-2C adrenoreceptor | adrenergic, alpha-2C-, receptor [Homo sapiens]
Type:
Enzyme
Mol. Mass.:
49552.32
Organism:
Homo sapiens (Human)
Description:
P18825
Residue:
462
  
Inhibitor
Name:
BDBM50417007
Synonyms:
FIPAMEZOLE
Type:
Small organic molecule
Emp. Form.:
C14H15FN2
Mol. Mass.:
230.2807
SMILES:
CCC1(Cc2ccc(F)cc2C1)c1cnc[nH]1
: