Target
Orexin/Hypocretin receptor type 1
Ligand
BDBM50419136
Substrate
Meas. Tech.
ChEMBL_768073 (CHEMBL1833029)
Ki
0.158±n/a nM
Citation
 Di Fabio, RPellacani, AFaedo, SRoth, APiccoli, LGerrard, PPorter, RAJohnson, CNThewlis, KDonati, DStasi, LSpada, SStemp, GNash, DBranch, CKindon, LMassagrande, MPoffe, ABraggio, SChiarparin, EMarchioro, CRatti, ECorsi, M Discovery process and pharmacological characterization of a novel dual orexin 1 and orexin 2 receptor antagonist useful for treatment of sleep disorders. Bioorg Med Chem Lett 21:5562-7 (2011)  
Target
Name:
Orexin/Hypocretin receptor type 1
Synonyms:
HCRTR1 OX1R_HUMAN Orexin receptor type 1 (OR 1) Orexin receptor type 1 (OX1) Orexin receptor type 1 (OxR1) | Ox1r
Type:
Protein
Mol. Mass.:
47554.50
Organism:
Homo sapiens (Human)
Description:
O43613
Residue:
425
  
Inhibitor
Name:
BDBM50419136
Synonyms:
CHEMBL1830961
Type:
Small organic molecule
Emp. Form.:
C26H25F2NO2
Mol. Mass.:
421.479
SMILES:
Fc1ccc(OCC[C@@H]2CCCCN2C(=O)c2ccccc2-c2ccccc2)c(F)c1
: