Target
Solute carrier family 22 member 3
Ligand
BDBM50420215
Substrate
Meas. Tech.
ChEMBL_837470 (CHEMBL2075864)
Ki
15±n/a nM
Citation
 Gründemann, DSchechinger, BRappold, GASchömig, E Molecular identification of the corticosterone-sensitive extraneuronal catecholamine transporter. Nat Neurosci 1:349-51 (1999)  
Target
Name:
Solute carrier family 22 member 3
Synonyms:
EMT Extraneuronal monoamine transporter Organic cation transporter 3 SLC22A3
Type:
PROTEIN
Mol. Mass.:
61292.57
Organism:
Homo sapiens (Human)
Description:
ChEMBL_934315
Residue:
556
  
Inhibitor
Name:
BDBM50420215
Synonyms:
CHEMBL339858
Type:
Small organic molecule
Emp. Form.:
C25H27N2
Mol. Mass.:
355.4947
SMILES:
CC(C)N1\C(=C/c2cc[n+](C(C)C)c3ccccc23)C=Cc2ccccc12
: