Target
Solute carrier family 22 member 1
Ligand
BDBM50017712
Substrate
Meas. Tech.
ChEMBL_838296 (CHEMBL2076244)
Ki
>20000±n/a nM
Citation
 Gründemann, DGorboulev, VGambaryan, SVeyhl, MKoepsell, H Drug excretion mediated by a new prototype of polyspecific transporter. Nature 372:549-552 (1994)  
Target
Name:
Solute carrier family 22 member 1
Synonyms:
Adrenaline alpha1 Organic cation transporter 1 Slc22a1 adrenergic Alpha1 | rOCT1
Type:
Enzyme Catalytic Domain
Mol. Mass.:
61538.40
Organism:
RAT
Description:
Adrenaline alpha1 0 RAT::Q63089
Residue:
556
  
Inhibitor
Name:
BDBM50017712
Synonyms:
(-)-reserpine 3,4,5-trimethoxybenzoyl methyl reserpate CHEMBL772 RESERPINE Serpalan methyl (3beta,16beta,17alpha,18beta,20alpha)-11,17-dimethoxy-18-[(3,4,5-trimethoxybenzoyl)oxy]yohimban-16-carboxylate
Type:
Small organic molecule
Emp. Form.:
C33H40N2O9
Mol. Mass.:
608.6787
SMILES:
CO[C@H]1[C@@H](C[C@@H]2CN3CCc4c([nH]c5cc(OC)ccc45)[C@H]3C[C@@H]2[C@@H]1C(=O)OC)OC(=O)c1cc(OC)c(OC)c(OC)c1
: