Target
Solute carrier family 22 member 1
Ligand
BDBM50420192
Substrate
Meas. Tech.
ChEMBL_838515 (CHEMBL2078143)
Ki
670±n/a nM
Citation
 Martel, FVetter, TRuss, HGründemann, DAzevedo, IKoepsell, HSchömig, E Transport of small organic cations in the rat liver. The role of the organic cation transporter OCT1. Naunyn Schmiedebergs Arch Pharmacol 354:320-6 (1997)  
Target
Name:
Solute carrier family 22 member 1
Synonyms:
Adrenaline alpha1 Organic cation transporter 1 Slc22a1 adrenergic Alpha1 | rOCT1
Type:
Enzyme Catalytic Domain
Mol. Mass.:
61538.40
Organism:
RAT
Description:
Adrenaline alpha1 0 RAT::Q63089
Residue:
556
  
Inhibitor
Name:
BDBM50420192
Synonyms:
CHEMBL2074851
Type:
Small organic molecule
Emp. Form.:
C24H26N3
Mol. Mass.:
356.4828
SMILES:
CC[n+]1c(CC2C=C(C)N=C(N2C)c2ccccc2)ccc2ccccc12
: