Target
Adenosine receptor A2a
Ligand
BDBM50420425
Substrate
Meas. Tech.
ChEMBL_840838 (CHEMBL2090621)
Ki
1800±n/a nM
Citation
 Tosh, DKPaoletta, SPhan, KGao, ZGJacobson, KA Truncated Nucleosides as A(3) Adenosine Receptor Ligands: Combined 2-Arylethynyl and Bicyclohexane Substitutions. ACS Med Chem Lett 3:596-601 (2012)  
Target
Name:
Adenosine receptor A2a
Synonyms:
A2A adenosine receptor (hA2A) ADENOSINE A2 ADORA2 Adenosine A2A receptor (A2AAR)
Type:
G Protein-Coupled Receptor (GPCR)
Mol. Mass.:
44716.46
Organism:
Homo sapiens (Human)
Description:
P29274
Residue:
412
  
Inhibitor
Name:
BDBM50420425
Synonyms:
CHEMBL2089344
Type:
Small organic molecule
Emp. Form.:
C26H21Cl2N5O2
Mol. Mass.:
506.383
SMILES:
O[C@@H]1[C@@H]2C[C@@H]2[C@H]([C@@H]1O)n1cnc2c(NCc3cccc(Cl)c3)nc(nc12)C#Cc1cccc(Cl)c1
: