Target
Beta-lactamase
Ligand
BDBM50330325
Substrate
Meas. Tech.
ChEMBL_839908 (CHEMBL2090109)
IC50
1060000±n/a nM
Citation
 Chen, PHorton, LBMikulski, RLDeng, LSundriyal, SPalzkill, TSong, Y 2-Substituted 4,5-dihydrothiazole-4-carboxylic acids are novel inhibitors of metallo-ß-lactamases. Bioorg Med Chem Lett 22:6229-32 (2012)  
Target
Name:
Beta-lactamase
Synonyms:
BAS3245 Beta-lactamase II bla2
Type:
Enzyme
Mol. Mass.:
28177.23
Organism:
Bacillus anthracis
Description:
Q93T40
Residue:
256
  
Inhibitor
Name:
BDBM50330325
Synonyms:
2,2',2'',2'''-(ethane-1,2-diylbis(azanetriyl))tetraacetic acid Edetate [{2-[bis(carboxymethyl)amino]ethyl}(carboxymethyl)amino]acetic acid {[-(BIS-CARBOXYMETHYL-AMINO)-ETHYL]-CARBOXYMETHYL-AMINO}-ACETIC ACID {[2-(Bis-carboxymethyl-amino)-ethyl]-carboxymethyl-amino}-acetic acid(EDTA)
Type:
Small organic molecule
Emp. Form.:
C10H16N2O8
Mol. Mass.:
292.2426
SMILES:
OC(=O)CN(CCN(CC(O)=O)CC(O)=O)CC(O)=O
: