Target
5-hydroxytryptamine receptor 2C
Ligand
BDBM50146360
Substrate
Meas. Tech.
ChEBML_2742
IC50
12±n/a nM
Citation
 Andrés, JIAlonso, JMFernández, JIturrino, LMartínez, PMeert, TFSipido, VK 2-(Dimethylaminomethyl)-tetrahydroisoxazolopyridobenzazepine derivatives. Synthesis of a new 5-HT(2C) antagonist with potential anxiolytic properties. Bioorg Med Chem Lett 12:3573-7 (2002)  
Target
Name:
5-hydroxytryptamine receptor 2C
Synonyms:
5-HT-1C 5-HT1C 5-HT2C-INI 5-HTR2C 5-hydroxytryptamine receptor 2C (5-HT-2C) 5HT-1C HTR1C Serotonin (5-HT3) receptor Serotonin Receptor 2C
Type:
G Protein-Coupled Receptor (GPCR)
Mol. Mass.:
51836.79
Organism:
Homo sapiens (Human)
Description:
P28335
Residue:
458
  
Inhibitor
Name:
BDBM50146360
Synonyms:
CHEMBL328573 | Dimethyl-[(2S,3aR)-1-(2,3,3a,8-tetrahydro-1-oxa-12b-aza-dibenzo[e,h]azulen-2-yl)methyl]-amine
Type:
Small organic molecule
Emp. Form.:
C19H22N2O
Mol. Mass.:
294.3908
SMILES:
CN(C)C[C@@H]1C[C@H]2N(O1)c1ccccc1Cc1ccccc21
: