Target
Beta-1 adrenergic receptor
Ligand
BDBM82497
Substrate
Meas. Tech.
ChEMBL_37099 (CHEMBL858098)
EC50
6026±n/a nM
Citation
 Markovich, KMTantishaiyakul, VHamada, AMiller, DDRomstedt, KJShams, GShin, YFraundorfer, PFDoyle, KFeller, DR Synthesis of halogenated trimetoquinol derivatives and evaluation of their beta-agonist and thromboxane A2 (TXA2) antagonist activities. J Med Chem 35:466-79 (1992)  
Target
Name:
Beta-1 adrenergic receptor
Synonyms:
ADRB1 adrenergic Beta1
Type:
Enzyme Catalytic Domain
Mol. Mass.:
50540.48
Organism:
GUINEA PIG
Description:
adrenergic Beta1 ADRB1 GUINEA PIG::B0FL73
Residue:
467
  
Inhibitor
Name:
BDBM82497
Synonyms:
TMQ, R-(-)-8-Fluoro
Type:
Small organic molecule
Emp. Form.:
C19H22FNO5
Mol. Mass.:
363.3801
SMILES:
COc1cc(C[C@H]2NCCc3cc(O)c(O)c(F)c23)cc(OC)c1OC
: