Target
Thromboxane A2 receptor
Ligand
BDBM82502
Substrate
Meas. Tech.
ChEBML_209427
IC50
3090±n/a nM
Citation
 Markovich, KMTantishaiyakul, VHamada, AMiller, DDRomstedt, KJShams, GShin, YFraundorfer, PFDoyle, KFeller, DR Synthesis of halogenated trimetoquinol derivatives and evaluation of their beta-agonist and thromboxane A2 (TXA2) antagonist activities. J Med Chem 35:466-79 (1992)  
Target
Name:
Thromboxane A2 receptor
Synonyms:
Prostanoid TP receptor TBXA2R Thromboxane Thromboxane Beta
Type:
Enyzme
Mol. Mass.:
37445.28
Organism:
Homo sapiens (Human)
Description:
P21731
Residue:
343
  
Inhibitor
Name:
BDBM82502
Synonyms:
TMQ, 8-Iodo
Type:
Small organic molecule
Emp. Form.:
C19H22INO5
Mol. Mass.:
471.2862
SMILES:
COc1cc(CC2NCCc3cc(O)c(O)c(I)c23)cc(OC)c1OC
: