Target
5-hydroxytryptamine receptor 5A
Ligand
BDBM50422027
Substrate
Meas. Tech.
ChEMBL_1079 (CHEMBL616402)
IC50
1995±n/a nM
Citation
 Castro, JLBaker, RGuiblin, ARHobbs, SCJenkins, MRRussell, MGBeer, MSStanton, JAScholey, KHargreaves, RJ Synthesis and biological activity of 3-[2-(dimethylamino)ethyl]-5-[(1,1-dioxo-5-methyl-1,2,5-thiadiazolidin- 2-yl)-methyl]-1H-indole and analogues: agonists for the 5-HT1D receptor. J Med Chem 37:3023-32 (1994)  
Target
Name:
5-hydroxytryptamine receptor 5A
Synonyms:
5-HT-5 5-hydroxytryptamine receptor 5 (5-HT5) 5HT5A_HUMAN Serotonin (5-HT) receptor | Serotonin receptor 5A
Type:
Enzyme
Mol. Mass.:
40266.25
Organism:
Homo sapiens (Human)
Description:
P47898
Residue:
357
  
Inhibitor
Name:
BDBM50422027
Synonyms:
CHEMBL2111620
Type:
Small organic molecule
Emp. Form.:
C14H19N3O2S2
Mol. Mass.:
325.45
SMILES:
CN1CCN(Cc2ccc3scc(CCN)c3c2)S1(=O)=O
: