Target
Integrin alpha-4/beta-1
Ligand
BDBM50423695
Substrate
Meas. Tech.
ChEMBL_599865 (CHEMBL1043648)
IC50
0.070000±n/a nM
Citation
 Venkatraman, SLebsack, ADAlves, KGardner, MFJames, JLingham, RBManiar, SMumford, RASi, QStock, NTreonze, KMWang, BZunic, JMunoz, B Discovery of N-{N-[(3-cyanobenzene) sulfonyl]-4(R)-(3,3-difluoropiperidin-1-yl)-(l)-prolyl}-4-[(3',5'-dichloro-isonicotinoyl) amino]-(l)-phenylalanine (MK-0617), a highly potent and orally active VLA-4 antagonist. Bioorg Med Chem Lett 19:5803-6 (2009)  
Target
Name:
Integrin alpha-4/beta-1
Synonyms:
Fibronectin receptor beta/Integrin alpha-4 | Integrin alpha-4/beta-1
Type:
Mol. Mass.:
Description:
ASSAY_ID of EBI is 88912
Components:
This complex has 2 components.
Component 1
Name:
Integrin beta-1
Synonyms:
CD_antigen=CD29 Fibronectin receptor beta GPIIA ITGB1 MDF2 | MSK12
Type:
Enzyme
Mol. Mass.:
88400.38
Organism:
Homo sapiens (Human)
Description:
P05556
Residue:
798
  
Component 2
Name:
Integrin alpha-4
Synonyms:
CD49 antigen-like family member D CD49d antigen ITA4_HUMAN Integrin alpha-4 Integrin alpha-IV VLA-4 integrin alpha 4 precursor | integrin alpha-4 precursor
Type:
Membrane Protein
Mol. Mass.:
114897.35
Organism:
Homo sapiens (Human)
Description:
P13612
Residue:
1032
  
Inhibitor
Name:
BDBM50423695
Synonyms:
CHEMBL566154 | MK-0617
Type:
Small organic molecule
Emp. Form.:
C32H30Cl2F2N6O6S
Mol. Mass.:
735.585
SMILES:
OC(=O)[C@H](Cc1ccc(NC(=O)c2c(Cl)cncc2Cl)cc1)NC(=O)[C@@H]1C[C@H](CN1S(=O)(=O)c1cccc(c1)C#N)N1CCCC(F)(F)C1
: