Target
Adenosine receptor A3
Ligand
BDBM50052293
Substrate
Meas. Tech.
ChEMBL_934969 (CHEMBL2320338)
Ki
23±n/a nM
Citation
 Catarzi, DColotta, VVarano, FPoli, DSquarcialupi, LFilacchioni, GVarani, KVincenzi, FBorea, PADal Ben, DLambertucci, CCristalli, G Pyrazolo[1,5-c]quinazoline derivatives and their simplified analogues as adenosine receptor antagonists: synthesis, structure-affinity relationships and molecular modeling studies. Bioorg Med Chem 21:283-94 (2012)  
Target
Name:
Adenosine receptor A3
Synonyms:
A3 adenosine receptor (hA3) ADORA3 | Adenosine A3 receptor (A3AR)
Type:
G Protein-Coupled Receptor (GPCR)
Mol. Mass.:
36197.32
Organism:
Homo sapiens (Human)
Description:
P0DMS8
Residue:
318
  
Inhibitor
Name:
BDBM50052293
Synonyms:
2-(4-Chloro-phenyl)-6H-pyrazolo[1,5-c]quinazolin-5-one | CHEMBL330664
Type:
Small organic molecule
Emp. Form.:
C16H10ClN3O
Mol. Mass.:
295.723
SMILES:
Clc1ccc(cc1)-c1cc2c3ccccc3[nH]c(=O)n2n1
: